2909,2,"2022-02-06 12:25:48","2022-02-06 11:25:48",,"<em>Romanogobio uranoscopus</em> ""Grenzmur""","Steingressling, Danubian longbarbel gudgeon",inherit,open,closed,,romanogobio-uranoscopus-grenzmur-02,,,"2022-02-06 21:52:39","2022-02-06 20:52:39",,0,https://pisces.at/wp-content/uploads/Romanogobio-uranoscopus-Grenzmur-02.jpg,0,attachment,image/jpeg,0,raw,6,0
2908,2,"2022-02-06 12:25:45","2022-02-06 11:25:45",,"<em>Romanogobio uranoscopus</em> ""Grenzmur""","Steingressling, Danubian longbarbel gudgeon",inherit,open,closed,,romanogobio-uranoscopus-grenzmur-01,,,"2022-02-06 21:52:39","2022-02-06 20:52:39",,0,https://pisces.at/wp-content/uploads/Romanogobio-uranoscopus-Grenzmur-01.jpg,0,attachment,image/jpeg,0,raw,6,0
2907,2,"2022-02-06 12:25:42","2022-02-06 11:25:42",,"<em>Romanogobio skywalkeri</em> ""Obere Mur""","Smaragdgressling, Emerald gudgeon",inherit,open,closed,,romanogobio-skywalkeri-obere-mur-05,,,"2022-02-07 10:22:55","2022-02-07 09:22:55",,0,https://pisces.at/wp-content/uploads/Romanogobio-skywalkeri-Obere-Mur-05.jpg,0,attachment,image/jpeg,0,raw,6,0
2906,2,"2022-02-06 12:25:39","2022-02-06 11:25:39",,"<em>Romanogobio skywalkeri</em> ""Obere Mur""","Smaragdgressling, Emerald gudgeon",inherit,open,closed,,romanogobio-skywalkeri-obere-mur-04,,,"2022-02-07 10:23:11","2022-02-07 09:23:11",,0,https://pisces.at/wp-content/uploads/Romanogobio-skywalkeri-Obere-Mur-04.jpg,0,attachment,image/jpeg,0,raw,6,0
2905,2,"2022-02-06 12:25:35","2022-02-06 11:25:35",,"<em>Romanogobio skywalkeri</em> ""Obere Mur""","Smaragdgressling, Emerald gudgeon",inherit,open,closed,,romanogobio-skywalkeri-obere-mur-03,,,"2022-02-07 10:23:18","2022-02-07 09:23:18",,0,https://pisces.at/wp-content/uploads/Romanogobio-skywalkeri-Obere-Mur-03.jpg,0,attachment,image/jpeg,0,raw,6,0
2904,2,"2022-02-06 12:25:32","2022-02-06 11:25:32",,"<em>Romanogobio skywalkeri</em> ""Obere Mur""","Smaragdgressling, Emerald gudgeon",inherit,open,closed,,romanogobio-skywalkeri-obere-mur-02,,,"2022-02-07 10:23:25","2022-02-07 09:23:25",,0,https://pisces.at/wp-content/uploads/Romanogobio-skywalkeri-Obere-Mur-02.jpg,0,attachment,image/jpeg,0,raw,6,0
2903,2,"2022-02-06 12:25:29","2022-02-06 11:25:29",,"<em>Romanogobio skywalkeri</em> ""Obere Mur""","Smaragdgressling, Emerald gudgeon",inherit,open,closed,,romanogobio-skywalkeri-obere-mur-01,,,"2022-02-07 10:23:32","2022-02-07 09:23:32",,0,https://pisces.at/wp-content/uploads/Romanogobio-skywalkeri-Obere-Mur-01.jpg,0,attachment,image/jpeg,0,raw,6,0
2902,2,"2022-02-06 12:25:26","2022-02-06 11:25:26",,"<em>Romanogobio carpathorossicus</em> ""Lafnitz""",Donau-Sandgründling,inherit,open,closed,,romanogobio-carpathorossicus-lafnitz-01,,,"2022-02-06 22:16:05","2022-02-06 21:16:05",,0,https://pisces.at/wp-content/uploads/Romanogobio-carpathorossicus-Lafnitz-01.jpg,0,attachment,image/jpeg,0,raw,6,0
2901,2,"2022-02-06 12:25:22","2022-02-06 11:25:22",,"<em>Rhodeus amarus</em> ""Weissenegger Mühlgang""","Europäischer Bitterling, European bitterling",inherit,open,closed,,rhodeus-amarus-weissenegger-muehlgang-03,,,"2022-02-07 07:56:52","2022-02-07 06:56:52",,0,https://pisces.at/wp-content/uploads/Rhodeus-amarus-Weissenegger-Muehlgang-03.jpg,0,attachment,image/jpeg,0,raw,6,0
2900,2,"2022-02-06 12:25:19","2022-02-06 11:25:19",,"<em>Rhodeus amarus</em> ""Trummerbach""","Europäischer Bitterling, European bitterling",inherit,open,closed,,rhodeus-amarus-trummerbach-04,,,"2022-02-07 07:57:11","2022-02-07 06:57:11",,0,https://pisces.at/wp-content/uploads/Rhodeus-amarus-Trummerbach-04.jpg,0,attachment,image/jpeg,0,raw,6,0
2899,2,"2022-02-06 12:25:16","2022-02-06 11:25:16",,"<em>Rhodeus amarus</em>","Europäischer Bitterling, European bitterling",inherit,open,closed,,rhodeus-amarus-02,,,"2022-02-07 07:57:19","2022-02-07 06:57:19",,0,https://pisces.at/wp-content/uploads/Rhodeus-amarus-02.jpg,0,attachment,image/jpeg,0,raw,6,0
2898,2,"2022-02-06 12:25:12","2022-02-06 11:25:12",,"<em>Rhodeus amarus</em>","Europäischer Bitterling, European bitterling",inherit,open,closed,,rhodeus-amarus-01,,,"2022-02-07 07:57:28","2022-02-07 06:57:28",,0,https://pisces.at/wp-content/uploads/Rhodeus-amarus-01.jpg,0,attachment,image/jpeg,0,raw,6,0
2897,2,"2022-02-06 12:25:09","2022-02-06 11:25:09",,"<em>Barbodes lateristriga</em>","Schwarzbandfleckbarbe, Spanner barb",inherit,open,closed,,barbodes-lateristriga-01,,,"2022-02-07 07:59:53","2022-02-07 06:59:53",,0,https://pisces.at/wp-content/uploads/Puntius-lateristriga-01.jpg,0,attachment,image/jpeg,0,raw,6,0
2895,2,"2022-02-06 12:25:02","2022-02-06 11:25:02",,"<em>Pseudorasbora parva</em> ""Drauchenbach""","Blaubandbärbling, Stone moroko",inherit,open,closed,,pseudorasbora-parva-drauchenbach-03,,,"2022-02-07 11:28:32","2022-02-07 10:28:32",,0,https://pisces.at/wp-content/uploads/Pseudorasbora-parva-Drauchenbach-03.jpg,0,attachment,image/jpeg,0,raw,6,0
2894,2,"2022-02-06 12:24:59","2022-02-06 11:24:59",,"<em>Pseudorasbora parva</em>","Blaubandbärbling, Stone moroko",inherit,open,closed,,pseudorasbora-parva-02,,,"2022-02-07 11:29:11","2022-02-07 10:29:11",,0,https://pisces.at/wp-content/uploads/Pseudorasbora-parva-02.jpg,0,attachment,image/jpeg,0,raw,6,0
2893,2,"2022-02-06 12:24:56","2022-02-06 11:24:56",,"<em>Posthodiplostomum sp.</em> on <em>Squalius cephalus</em> ""Drauchenbach""",,inherit,open,closed,,posthodiplostomum-squalius-cephalus-drauchenbach-01,,,"2022-02-06 12:34:49","2022-02-06 11:34:49",,0,https://pisces.at/wp-content/uploads/Posthodiplostomum-Squalius-cephalus-Drauchenbach-01.jpg,0,attachment,image/jpeg,0,raw,6,0
2892,2,"2022-02-06 12:24:53","2022-02-06 11:24:53",,"<em>Pimephales promelas</em> ""Gold""","Fettköpfige Elritze, Fathead minnow",inherit,open,closed,,pimephales-promelas-gold-01,,,"2022-02-07 13:02:36","2022-02-07 12:02:36",,0,https://pisces.at/wp-content/uploads/Pimephales-promelas-Gold-01.jpg,0,attachment,image/jpeg,0,raw,6,0
2891,2,"2022-02-06 12:24:50","2022-02-06 11:24:50",,"<em>Phoxinus phoxinus</em>","Elritze, Eurasian minnow",inherit,open,closed,,phoxinus-phoxinus-02,,,"2022-02-07 18:09:03","2022-02-07 17:09:03",,0,https://pisces.at/wp-content/uploads/Phoxinus-sp-02.jpg,0,attachment,image/jpeg,0,raw,6,0
2890,2,"2022-02-06 12:24:47","2022-02-06 11:24:47",,"<em>Phoxinus phoxinus</em>","Elritze, Eurasian minnow",inherit,open,closed,,phoxinus-phoxinus-01,,,"2022-02-07 18:09:17","2022-02-07 17:09:17",,0,https://pisces.at/wp-content/uploads/Phoxinus-sp-01.jpg,0,attachment,image/jpeg,0,raw,6,0
2889,2,"2022-02-06 12:24:44","2022-02-06 11:24:44",,"<em>Pelecus cultratus</em> ""Neusiedler See""","Sichling (Ziege), Sichel",inherit,open,closed,,pelecus-cultratus-neusiedler-see-01,,,"2022-02-09 15:58:42","2022-02-09 14:58:42",,0,https://pisces.at/wp-content/uploads/Pelecus-cultratus-Neusiedler-See-01.jpg,0,attachment,image/jpeg,0,raw,6,0
