769,2,"2021-09-06 20:39:22","2021-09-06 18:39:22",,"<em>Bombina variegata</em>","Gelbbauchunke, Yellow-bellied toad",inherit,open,closed,,bombina-variegata-01,,,"2021-09-16 16:38:27","2021-09-16 14:38:27",,0,https://neu.pisces.at/wp-content/uploads/Bombina-variegata-01.jpg,0,attachment,image/jpeg,0,raw,6,0
768,2,"2021-09-06 20:39:16","2021-09-06 18:39:16",,"<em>Aulonocranus dewindti</em> ""Isanga""",Uferbuntbarsch,inherit,open,closed,,aulonocranus-dewindti-isanga-02,,,"2021-10-31 19:22:47","2021-10-31 18:22:47",,0,https://neu.pisces.at/wp-content/uploads/Aulonocranus-dewindti-Isanga-02.jpg,0,attachment,image/jpeg,0,raw,6,0
767,2,"2021-09-06 20:39:11","2021-09-06 18:39:11",,"<em>Aulonocranus dewindti</em>",Uferbuntbarsch,inherit,open,closed,,aulonocranus-dewindti-01,,,"2021-10-31 19:23:17","2021-10-31 18:23:17",,0,https://neu.pisces.at/wp-content/uploads/Aulonocranus-dewindti-01.jpg,0,attachment,image/jpeg,0,raw,6,0
766,2,"2021-09-06 20:39:04","2021-09-06 18:39:04",,"<em>Aulonocara baenschi</em>""breeding form""",,inherit,open,closed,,aulonocara-baenschi-01-mm,,,"2021-10-31 19:26:25","2021-10-31 18:26:25",,0,https://neu.pisces.at/wp-content/uploads/Aulonocara-baenschi-01-mm.jpg,0,attachment,image/jpeg,0,raw,6,0
765,2,"2021-09-06 20:38:58","2021-09-06 18:38:58",,"<em>Astropecten spinulosus</em>",,inherit,open,closed,,astropecten-spinulosus-01,,,"2021-10-29 11:47:40","2021-10-29 09:47:40",,0,https://neu.pisces.at/wp-content/uploads/Astropecten-spinulosus-01.jpg,0,attachment,image/jpeg,0,raw,6,0
764,2,"2021-09-06 20:38:54","2021-09-06 18:38:54",,"<em>Astronotus ocellatus</em>","Pfauenaugenbuntbarsch, Oscar",inherit,open,closed,,astronotus-ocellatus-01,,,"2021-10-31 13:35:58","2021-10-31 12:35:58",,0,https://neu.pisces.at/wp-content/uploads/Astronotus-ocellatus-01.jpg,0,attachment,image/jpeg,0,raw,6,0
763,2,"2021-09-06 20:38:48","2021-09-06 18:38:48",,"<em>Archocentrus multispinosus</em>","Regenbogencichlide, Rainbow cichlid",inherit,open,closed,,archocentrus-multispinosus-01,,,"2021-10-29 13:55:17","2021-10-29 11:55:17",,0,https://neu.pisces.at/wp-content/uploads/Archocentrus-multispinosus-01.jpg,0,attachment,image/jpeg,0,raw,6,0
762,2,"2021-09-06 20:38:43","2021-09-06 18:38:43",,"<em>Apteronotus albifrons/em>","Weißstirn-Messerfisch, Black ghost knifefish",inherit,open,closed,,apteronotus-albifrons-01,,,"2021-10-21 16:38:54","2021-10-21 14:38:54",,0,https://neu.pisces.at/wp-content/uploads/Apteronotus-albifrons-01.jpg,0,attachment,image/jpeg,0,raw,6,0
761,2,"2021-09-06 20:38:38","2021-09-06 18:38:38",,"<em>Anguis fragilis</em>","Blindschleiche, Slow worm",inherit,open,closed,,anguis-fragilis-02,,,"2021-10-05 19:44:18","2021-10-05 17:44:18",,0,https://neu.pisces.at/wp-content/uploads/Anguis-fragilis-02.jpg,0,attachment,image/jpeg,0,raw,6,0
760,2,"2021-09-06 20:38:34","2021-09-06 18:38:34",,"<em>Anguis fragilis</em>","Blindschleiche, Slow worm",inherit,open,closed,,anguis-fragilis-01,,,"2021-10-05 19:44:18","2021-10-05 17:44:18",,0,https://neu.pisces.at/wp-content/uploads/Anguis-fragilis-01.jpg,0,attachment,image/jpeg,0,raw,6,0
759,2,"2021-09-06 20:38:30","2021-09-06 18:38:30",,"<em>Andinoacara rivulatus</em>","Goldsaumbuntbarsch, Green terror",inherit,open,closed,,andinoacara-rivulatus-01,,,"2021-10-29 13:53:56","2021-10-29 11:53:56",,0,https://neu.pisces.at/wp-content/uploads/Andinoacara-rivulatus-01.jpg,0,attachment,image/jpeg,0,raw,6,0
758,2,"2021-09-06 20:38:24","2021-09-06 18:38:24",,"<em>Amietophrynus gutturalis</em>","Guttural toad",inherit,open,closed,,amietophrynus-gutturalis,,,"2021-10-05 20:16:38","2021-10-05 18:16:38",,0,https://neu.pisces.at/wp-content/uploads/Amietophrynus-gutturalis.jpg,0,attachment,image/jpeg,0,raw,6,0
757,2,"2021-09-06 20:38:15","2021-09-06 18:38:15",,"<em>Amatitlania nigrofasciata</em> ""Villacher Warmbad""","Zebrabuntbarsch, Convict cichlid",inherit,open,closed,,amatitlania-nigrofasciata-villacher-warmbad-02,,,"2021-09-16 12:36:36","2021-09-16 10:36:36",,0,https://neu.pisces.at/wp-content/uploads/Amatitlania-nigrofasciata-Villacher-Warmbad-02.jpg,0,attachment,image/jpeg,0,raw,6,0
756,2,"2021-09-06 20:38:09","2021-09-06 18:38:09",,"<em>Altolamprologus sp.</em> ""Sumbu shell""",,inherit,open,closed,,altolamprologus-sp-sumbu-shell-01,,,"2021-10-13 15:10:07","2021-10-13 13:10:07",,0,https://neu.pisces.at/wp-content/uploads/Altolamprologus-sp-Sumbu-shell-01.jpg,0,attachment,image/jpeg,0,raw,6,0
755,2,"2021-09-06 20:38:05","2021-09-06 18:38:05",,"<em>Altolamprologus compressiceps</em>""Gold Head""",,inherit,open,closed,,altolamprologus-compressiceps-gold-head-03,,,"2021-10-13 15:12:28","2021-10-13 13:12:28",,0,https://neu.pisces.at/wp-content/uploads/Altolamprologus-compressiceps-Gold-Head-03.jpg,0,attachment,image/jpeg,0,raw,6,0
754,2,"2021-09-06 20:37:59","2021-09-06 18:37:59",,"<em>Altolamprologus compressiceps</em>""Gold Head""",,inherit,open,closed,,altolamprologus-compressiceps-gold-head-02,,,"2021-10-13 15:12:12","2021-10-13 13:12:12",,0,https://neu.pisces.at/wp-content/uploads/Altolamprologus-compressiceps-Gold-Head-02.jpg,0,attachment,image/jpeg,0,raw,6,0
753,2,"2021-09-06 20:37:54","2021-09-06 18:37:54",,"<em>Altolamprologus compressiceps</em>",,inherit,open,closed,,altolamprologus-compressiceps-01,,,"2021-10-13 15:11:35","2021-10-13 13:11:35",,0,https://neu.pisces.at/wp-content/uploads/Altolamprologus-compressiceps-01.jpg,0,attachment,image/jpeg,0,raw,6,0
701,2,"2021-08-25 00:32:37","2021-08-24 22:32:37",,"<em>Acipenser gueldenstaedtii</em>","Russischer Stör, Russian sturgeon",inherit,open,closed,,acipenser-gueldenstaedtii-01,,,"2021-08-28 15:16:36","2021-08-28 13:16:36",,0,https://neu.pisces.at/wp-content/uploads/Acipenser-gueldenstaedtii-01.jpg,0,attachment,image/jpeg,0,raw,6,0
700,2,"2021-08-25 00:32:34","2021-08-24 22:32:34",,"<em>Acipenser baerii</em>","Sibirischer Stör, Siberian sturgeon",inherit,open,closed,,acipenser-baerii-01,,,"2021-08-28 15:17:38","2021-08-28 13:17:38",,0,https://neu.pisces.at/wp-content/uploads/Acipenser-baerii-01.jpg,0,attachment,image/jpeg,0,raw,6,0
699,2,"2021-08-25 00:32:30","2021-08-24 22:32:30",<em></em>,"<em>Trichogaster lalius</em>","Zwergfadenfisch, Dwarf gourami",inherit,open,closed,,trichogaster-lalius-01,,,"2021-08-28 12:47:18","2021-08-28 10:47:18",,0,https://neu.pisces.at/wp-content/uploads/Trichogaster-lalius-01.jpg,0,attachment,image/jpeg,0,raw,6,0
