789,2,"2021-09-06 20:40:58","2021-09-06 18:40:58",,"<em>Altolamprologus calvus</em> ""Black Pearl""","Perlhuhncichlide, ",inherit,open,closed,,altolamprologus-calvus-black-pearl-02,,,"2021-09-08 15:51:25","2021-09-08 13:51:25",,0,https://neu.pisces.at/wp-content/uploads/Altolamprologus-calvus-Black-Pearl-02.jpg,0,attachment,image/jpeg,0,raw,6,0
788,2,"2021-09-06 20:40:53","2021-09-06 18:40:53",,"<em>Altolamprologus calvus</em>",Perlhuhncichlide,inherit,open,closed,,altolamprologus-calvus-03,,,"2021-09-08 15:52:10","2021-09-08 13:52:10",,0,https://neu.pisces.at/wp-content/uploads/Altolamprologus-calvus-03.jpg,0,attachment,image/jpeg,0,raw,6,0
787,2,"2021-09-06 20:40:48","2021-09-06 18:40:48",,"<em>Python regius</em>","Königspython, Ball python",inherit,open,closed,,python-regius-02,,,"2021-09-08 15:53:41","2021-09-08 13:53:41",,0,https://neu.pisces.at/wp-content/uploads/Python-regius-02.jpg,0,attachment,image/jpeg,0,raw,6,0
786,2,"2021-09-06 20:40:44","2021-09-06 18:40:44",,"<em>Python regius</em>","Königspython, Ball python",inherit,open,closed,,python-regius-01,,,"2021-09-08 15:54:24","2021-09-08 13:54:24",,0,https://neu.pisces.at/wp-content/uploads/Python-regius-01.jpg,0,attachment,image/jpeg,0,raw,6,0
785,2,"2021-09-06 20:40:38","2021-09-06 18:40:38",,"<em>Protoreaster sp.</em>",,inherit,open,closed,,protoreaster-sp-01,,,"2021-09-08 15:59:44","2021-09-08 13:59:44",,0,https://neu.pisces.at/wp-content/uploads/Protoreaster-sp-01.jpg,0,attachment,image/jpeg,0,raw,6,0
784,2,"2021-09-06 20:40:34","2021-09-06 18:40:34",,"<em>Echinaster sepositus</em>","Purpurstern, Mediterranean red sea star",inherit,open,closed,,echinaster-sepositus-01,,,"2021-09-08 16:01:24","2021-09-08 14:01:24",,0,https://neu.pisces.at/wp-content/uploads/Echinaster-sepositus-01.jpg,0,attachment,image/jpeg,0,raw,6,0
783,2,"2021-09-06 20:40:29","2021-09-06 18:40:29",,"<em>Dichotomyctere nigroviridis</em>","Grüner Kugelfisch, Green spottet puffer",inherit,open,closed,,dichotomyctere-nigroviridis-01,,,"2021-09-08 16:07:04","2021-09-08 14:07:04",,0,https://neu.pisces.at/wp-content/uploads/Dichotomyctere-nigroviridis-01.jpg,0,attachment,image/jpeg,0,raw,6,0
782,2,"2021-09-06 20:40:25","2021-09-06 18:40:25",,"<em>Dermogenys pusilla</em>","Halbschnabelhecht, Wrestling halfbeak",inherit,open,closed,,dermogenys-pusilla-01,,,"2021-09-08 16:08:19","2021-09-08 14:08:19",,0,https://neu.pisces.at/wp-content/uploads/Dermogenys-pusilla-01.jpg,0,attachment,image/jpeg,0,raw,6,0
781,2,"2021-09-06 20:40:20","2021-09-06 18:40:20",,"<em>Ctenolucius hujeta</em>","Hujeta-Hechtsalmler, Silver gar",inherit,open,closed,,ctenolucius-hujeta-01,,,"2021-09-08 16:10:57","2021-09-08 14:10:57",,0,https://neu.pisces.at/wp-content/uploads/Ctenolucius-hujeta-01.jpg,0,attachment,image/jpeg,0,raw,6,0
780,2,"2021-09-06 20:40:15","2021-09-06 18:40:15",,"<em>Coscinasterias tenuispina</em>","Vielarmiger Seestern, Blue spiny starfish",inherit,open,closed,,coscinasterias-tenuispina-01,,,"2021-09-08 16:13:09","2021-09-08 14:13:09",,0,https://neu.pisces.at/wp-content/uploads/Coscinasterias-tenuispina-01.jpg,0,attachment,image/jpeg,0,raw,6,0
779,2,"2021-09-06 20:40:10","2021-09-06 18:40:10",,"<em>Coronella austriaca</em>","Schlingnatter, Smooth snake",inherit,open,closed,,coronella-austriaca-02,,,"2021-09-16 12:30:45","2021-09-16 10:30:45",,0,https://neu.pisces.at/wp-content/uploads/Coronella-austriaca-02.jpg,0,attachment,image/jpeg,0,raw,6,0
778,2,"2021-09-06 20:40:06","2021-09-06 18:40:06",,"<em>Coronella austriaca</em>","Schlingnatter, Smooth snake",inherit,open,closed,,coronella-austriaca-01,,,"2021-09-16 12:31:27","2021-09-16 10:31:27",,0,https://neu.pisces.at/wp-content/uploads/Coronella-austriaca-01.jpg,0,attachment,image/jpeg,0,raw,6,0
777,2,"2021-09-06 20:40:01","2021-09-06 18:40:01",,"<em>Chelon labrosus</em>","Dicklippige Meeräsche, Thicklip grey mullet",inherit,open,closed,,chelon-labrosus-01,,,"2021-09-08 16:15:00","2021-09-08 14:15:00",,0,https://neu.pisces.at/wp-content/uploads/Chelon-labrosus-01.jpg,0,attachment,image/jpeg,0,raw,6,0
776,2,"2021-09-06 20:39:57","2021-09-06 18:39:57",,"<em>Bufotes viridis</em>","Wechselkröte, European green toad",inherit,open,closed,,bufotes-viridis-03,,,"2021-09-16 14:26:23","2021-09-16 12:26:23",,0,https://neu.pisces.at/wp-content/uploads/Bufotes-viridis-03.jpg,0,attachment,image/jpeg,0,raw,6,0
775,2,"2021-09-06 20:39:52","2021-09-06 18:39:52",,"<em>Bufotes viridis</em>","Wechselkröte, European green toad",inherit,open,closed,,bufotes-viridis-02,,,"2021-09-16 14:27:03","2021-09-16 12:27:03",,0,https://neu.pisces.at/wp-content/uploads/Bufotes-viridis-02.jpg,0,attachment,image/jpeg,0,raw,6,0
774,2,"2021-09-06 20:39:46","2021-09-06 18:39:46",,"<em>Bufotes viridis</em>","Wechselkröte, European green toad",inherit,open,closed,,bufotes-viridis-01,,,"2021-09-16 14:27:46","2021-09-16 12:27:46",,0,https://neu.pisces.at/wp-content/uploads/Bufotes-viridis-01.jpg,0,attachment,image/jpeg,0,raw,6,0
773,2,"2021-09-06 20:39:42","2021-09-06 18:39:42",,"<em>Bufo bufo</em>","Erdkröte, Common toad",inherit,open,closed,,bufo-bufo-02,,,"2021-09-16 16:34:56","2021-09-16 14:34:56",,0,https://neu.pisces.at/wp-content/uploads/Bufo-bufo-02.jpg,0,attachment,image/jpeg,0,raw,6,0
772,2,"2021-09-06 20:39:36","2021-09-06 18:39:36",,"<em>Bufo bufo</em>","Erdkröte, Common toad",inherit,open,closed,,bufo-bufo-01,,,"2021-09-16 16:35:35","2021-09-16 14:35:35",,0,https://neu.pisces.at/wp-content/uploads/Bufo-bufo-01.jpg,0,attachment,image/jpeg,0,raw,6,0
771,2,"2021-09-06 20:39:32","2021-09-06 18:39:32",,"<em>Bombina variegata</em>","Gelbbauchunke, Yellow-bellied toad",inherit,open,closed,,bombina-variegata-03,,,"2021-09-16 16:36:59","2021-09-16 14:36:59",,0,https://neu.pisces.at/wp-content/uploads/Bombina-variegata-03.jpg,0,attachment,image/jpeg,0,raw,6,0
770,2,"2021-09-06 20:39:27","2021-09-06 18:39:27",,"<em>Bombina variegata</em>","Gelbbauchunke, Yellow-bellied toad",inherit,open,closed,,bombina-variegata-02,,,"2021-09-16 16:37:44","2021-09-16 14:37:44",,0,https://neu.pisces.at/wp-content/uploads/Bombina-variegata-02.jpg,0,attachment,image/jpeg,0,raw,6,0
